{"text_format":"1","workbook":"xlsx","n_sheets":7,"sheets":["Instruções - Propriedade","Lista Verificação Propriedade","Relatório da Farma","Instruções - Fomento","Lista de Verificação de Fomento","Relatório do Fomento","DropDowns"],"not_rendered":{"charts":0,"images":7,"macros":0,"external_links":0,"defined_names":6,"comments":0,"pivot_tables":0},"unopened":[],"bounds":{"document_bytes":16777216,"sheet_cells":100000,"rows_first":2000,"rows_last":500,"rows_between":2000,"halvings":0,"cell_chars":16384,"cell_head_chars":4096},"cells_cut":0,"cells_raw":0,"read":"whole","date_system":"1900"}

{"sheet":"Instruções - Propriedade","index":0,"n_rows":40,"n_cols":2,"rows_kept":40,"cut":false,"hidden":false,"merged":[[1,1,1,16],[39,1,39,16],[38,1,38,16]]}
[]
[null,"FERRAMENTA DE NAVEGAÇÃO & INSTRUÇÕES DE ENTRADA"]
[]
[]
[]
[]
[]
[]
[]
[]
{"$rows_left_out":31}
{"sheet":"Lista Verificação Propriedade","index":1,"n_rows":397,"n_cols":10,"rows_kept":397,"cut":false,"hidden":false,"merged":[]}
[]
[null,1,"Lista de verificação da avaliação",null,"Estado/Ponto de Situação","Comentários e Documentação","Risco (1=baixo; 3=alto)",null,"Report Ident","Group"]
[null,2]
[null,3,"I. Política Corporativa e Avaliação de Capacidade",{"$f":"IF(COUNT(D6:D22)=0,\"\",ROUND(SUM(D6:D22)/COUNT(D6:D22),0))","v":""},null,null,{"$f":"IFERROR(ROUND(SUM(G5:G23)/COUNT(G5:G23),0),\"\")","v":""}]
[null,4]
[null,5,"1.1 Política de Avaliação"]
[null,6,"1.1.1 A empresa possui uma política relacionada com investimentos responsáveis na questão de terra?",{"$f":"IF(OR(E7=\"\",E7=\"(seleccione a opção)\"),\"\",IF(VLOOKUP(E7,DropDowns!B:D,3,0)=0,\"\",VLOOKUP(E7,DropDowns!B:D,3,0)))","v":""},"(seleccione a opção)",null,"(seleccione o nível)",null,{"$f":"IF(OR(AND(D7<3,E7<>\"N/A\" ),AND(G7>1,G7<>\"(seleccione o nível)\",E7<>\"N/A\")),\"Yes\",\"No\")","v":"No"},1]
[null,7,"1.1.2 Se sim, a política já foi implementada ou existe um plano para a sua implementação?",{"$f":"IF(OR(E8=\"\",E8=\"(seleccione a opção)\"),\"\",IF(VLOOKUP(E8,DropDowns!B:D,3,0)=0,\"\",VLOOKUP(E8,DropDowns!B:D,3,0)))","v":""},"(seleccione a opção)",null,"(seleccione o nível)",null,{"$f":"IF(OR(AND(D8<3,E8<>\"N/A\" ),AND(G8>1,G8<>\"(seleccione o nível)\",E8<>\"N/A\")),\"Yes\",\"No\")","v":"No"},1]
[null,8,"1.1.3 A empresa possui uma política sobre direitos das mulheres, incluindo direito à terra?",{"$f":"IF(OR(E9=\"\",E9=\"(seleccione a opção)\"),\"\",IF(VLOOKUP(E9,DropDowns!B:D,3,0)=0,\"\",VLOOKUP(E9,DropDowns!B:D,3,0)))","v":""},"(seleccione a opção)",null,"(seleccione o nível)",null,"No",1]
[null,9,"1.1.4 Se sim, a política já foi implementada ou existe um plano para a sua implementação?",{"$f":"IF(OR(E10=\"\",E10=\"(seleccione a opção)\"),\"\",IF(VLOOKUP(E10,DropDowns!B:D,3,0)=0,\"\",VLOOKUP(E10,DropDowns!B:D,3,0)))","v":""},"(seleccione a opção)",null,"(seleccione o nível)",null,"No",1]
{"$rows_left_out":388}
{"sheet":"Relatório da Farma","index":2,"n_rows":200,"n_cols":12,"rows_kept":200,"cut":false,"hidden":false,"merged":[[3,7,3,10],[1,1,1,11]]}
[]
[null,"Relatório de Seguimento "]
[]
[null,"Checklist Row"," Item de verificação","Secção (Título da Principal Lista de Verificação)","Ponto de Situação","Risco(1=baixo; 3=alto)","Acções de Seguimento","Capacidade (Quem vai realizar as actividades do plano)",null,null,null,"Cronograma/ Passos a dar"]
[null,{"$f":"IFERROR(INDEX('Lista Verificação Propriedade'!$B$1:$B$397, SMALL(INDEX(('Lista Verificação Propriedade'!$I$1:$I$397=\"Yes\")*(MATCH(ROW('Lista Verificação Propriedade'!$I$1:$I$397), ROW('Lista Verificação Propriedade'!$I$1:$I$397)))+('Lista Verificação Propriedade'!$I$1:$I$397<>\"Yes\")*1048577, 0, 0), ROW(A1))),\"\")","v":""},{"$f":"IFERROR(VLOOKUP(B5,'Lista Verificação Propriedade'!B:C,2,0),\"\")","v":""},{"$f":"IFERROR(VLOOKUP(VLOOKUP(B5,'Lista Verificação Propriedade'!B:J,9,0),DropDowns!G:H,2,0),\"\")","v":""},{"$f":"IFERROR(VLOOKUP(B5,'Lista Verificação Propriedade'!B:E,4,0),\"\")","v":""},{"$f":"IFERROR(VLOOKUP(B5,'Lista Verificação Propriedade'!B:G,6,0),\"\")","v":""},null,{"$f":"IF(B5<>\"\",\"Interna:\",\"\")","v":""},null,{"$f":"IF(B5<>\"\",\"Externa:\",\"\")","v":""}]
[null,{"$f":"IFERROR(INDEX('Lista Verificação Propriedade'!$B$1:$B$397, SMALL(INDEX(('Lista Verificação Propriedade'!$I$1:$I$397=\"Yes\")*(MATCH(ROW('Lista Verificação Propriedade'!$I$1:$I$397), ROW('Lista Verificação Propriedade'!$I$1:$I$397)))+('Lista Verificação Propriedade'!$I$1:$I$397<>\"Yes\")*1048577, 0, 0), ROW(A2))),\"\")","v":""},{"$f":"IFERROR(VLOOKUP(B6,'Lista Verificação Propriedade'!B:C,2,0),\"\")","v":""},{"$f":"IFERROR(VLOOKUP(VLOOKUP(B6,'Lista Verificação Propriedade'!B:J,9,0),DropDowns!G:H,2,0),\"\")","v":""},{"$f":"IFERROR(VLOOKUP(B6,'Lista Verificação Propriedade'!B:E,4,0),\"\")","v":""},{"$f":"IFERROR(VLOOKUP(B6,'Lista Verificação Propriedade'!B:G,6,0),\"\")","v":""},null,{"$f":"IF(B6<>\"\",\"Interna:\",\"\")","v":""},null,{"$f":"IF(B6<>\"\",\"Externa:\",\"\")","v":""}]
[null,{"$f":"IFERROR(INDEX('Lista Verificação Propriedade'!$B$1:$B$397, SMALL(INDEX(('Lista Verificação Propriedade'!$I$1:$I$397=\"Yes\")*(MATCH(ROW('Lista Verificação Propriedade'!$I$1:$I$397), ROW('Lista Verificação Propriedade'!$I$1:$I$397)))+('Lista Verificação Propriedade'!$I$1:$I$397<>\"Yes\")*1048577, 0, 0), ROW(A3))),\"\")","v":""},{"$f":"IFERROR(VLOOKUP(B7,'Lista Verificação Propriedade'!B:C,2,0),\"\")","v":""},{"$f":"IFERROR(VLOOKUP(VLOOKUP(B7,'Lista Verificação Propriedade'!B:J,9,0),DropDowns!G:H,2,0),\"\")","v":""},{"$f":"IFERROR(VLOOKUP(B7,'Lista Verificação Propriedade'!B:E,4,0),\"\")","v":""},{"$f":"IFERROR(VLOOKUP(B7,'Lista Verificação Propriedade'!B:G,6,0),\"\")","v":""},null,"",null,""]
[null,{"$f":"IFERROR(INDEX('Lista Verificação Propriedade'!$B$1:$B$397, SMALL(INDEX(('Lista Verificação Propriedade'!$I$1:$I$397=\"Yes\")*(MATCH(ROW('Lista Verificação Propriedade'!$I$1:$I$397), ROW('Lista Verificação Propriedade'!$I$1:$I$397)))+('Lista Verificação Propriedade'!$I$1:$I$397<>\"Yes\")*1048577, 0, 0), ROW(A4))),\"\")","v":""},{"$f":"IFERROR(VLOOKUP(B8,'Lista Verificação Propriedade'!B:C,2,0),\"\")","v":""},{"$f":"IFERROR(VLOOKUP(VLOOKUP(B8,'Lista Verificação Propriedade'!B:J,9,0),DropDowns!G:H,2,0),\"\")","v":""},{"$f":"IFERROR(VLOOKUP(B8,'Lista Verificação Propriedade'!B:E,4,0),\"\")","v":""},{"$f":"IFERROR(VLOOKUP(B8,'Lista Verificação Propriedade'!B:G,6,0),\"\")","v":""},null,"",null,""]
[null,{"$f":"IFERROR(INDEX('Lista Verificação Propriedade'!$B$1:$B$397, SMALL(INDEX(('Lista Verificação Propriedade'!$I$1:$I$397=\"Yes\")*(MATCH(ROW('Lista Verificação Propriedade'!$I$1:$I$397), ROW('Lista Verificação Propriedade'!$I$1:$I$397)))+('Lista Verificação Propriedade'!$I$1:$I$397<>\"Yes\")*1048577, 0, 0), ROW(A5))),\"\")","v":""},{"$f":"IFERROR(VLOOKUP(B9,'Lista Verificação Propriedade'!B:C,2,0),\"\")","v":""},{"$f":"IFERROR(VLOOKUP(VLOOKUP(B9,'Lista Verificação Propriedade'!B:J,9,0),DropDowns!G:H,2,0),\"\")","v":""},{"$f":"IFERROR(VLOOKUP(B9,'Lista Verificação Propriedade'!B:E,4,0),\"\")","v":""},{"$f":"IFERROR(VLOOKUP(B9,'Lista Verificação Propriedade'!B:G,6,0),\"\")","v":""},null,"",null,""]
[null,{"$f":"IFERROR(INDEX('Lista Verificação Propriedade'!$B$1:$B$397, SMALL(INDEX(('Lista Verificação Propriedade'!$I$1:$I$397=\"Yes\")*(MATCH(ROW('Lista Verificação Propriedade'!$I$1:$I$397), ROW('Lista Verificação Propriedade'!$I$1:$I$397)))+('Lista Verificação Propriedade'!$I$1:$I$397<>\"Yes\")*1048577, 0, 0), ROW(A6))),\"\")","v":""},{"$f":"IFERROR(VLOOKUP(B10,'Lista Verificação Propriedade'!B:C,2,0),\"\")","v":""},{"$f":"IFERROR(VLOOKUP(VLOOKUP(B10,'Lista Verificação Propriedade'!B:J,9,0),DropDowns!G:H,2,0),\"\")","v":""},{"$f":"IFERROR(VLOOKUP(B10,'Lista Verificação Propriedade'!B:E,4,0),\"\")","v":""},{"$f":"IFERROR(VLOOKUP(B10,'Lista Verificação Propriedade'!B:G,6,0),\"\")","v":""},null,"",null,""]
{"$rows_left_out":191}
{"sheet":"Instruções - Fomento","index":3,"n_rows":40,"n_cols":2,"rows_kept":40,"cut":false,"hidden":false,"merged":[[1,1,1,16],[38,1,38,16],[39,1,39,16]]}
[]
[null,"NAVEGAÇÃO DE FERRAMENTAS & INSTRUÇÕES DE ENTRADA"]
[]
[]
[]
[]
[]
[]
[]
[]
{"$rows_left_out":31}
{"sheet":"Lista de Verificação de Fomento","index":4,"n_rows":326,"n_cols":10,"rows_kept":326,"cut":false,"hidden":false,"merged":[]}
[]
[null,1,"Listas de verificação da avaliação",null,"Estado/Ponto de Situação","Comentários & Documentação","Risco (1=baixo; 3=alto)",null,"Report Ident","Group"]
[null,2]
[null,3,"I. Política de Fomento e Avaliação de Capacidade",{"$f":"IF(COUNT(D5:D19)=0,\"\",ROUND(SUM(D5:D19)/COUNT(D5:D19),0))","v":""},null,null,{"$f":"IFERROR(ROUND(SUM(G5:G18)/COUNT(G5:G18),0),\"\")","v":""}]
[null,4,null,{"$f":"IF(OR(E5=\"\",E5=\"(select option)\"),\"\",VLOOKUP(E5,DropDowns!C:D,2,0))","v":""}]
[null,5,"1.1 Política de Fomento"]
[null,6,"1.1.1 As políticas de direitos fundiários e da Avaliação de Impacto Social e Ambiental (AISA) da empresa aplicam-se a esquemas de fomento ou a outros modelos de negócios alternativos (além da propriedade que a empresa possui, arrenda ou usa directamente)?",{"$f":"IF(OR(E7=\"\",E7=\"(seleccione a opção)\"),\"\",IF(VLOOKUP(E7,DropDowns!B:D,3,0)=0,\"\",VLOOKUP(E7,DropDowns!B:D,3,0)))","v":""},"(seleccione a opção)",null,"(seleccione o nível)",null,{"$f":"IF(OR(AND(D7<3,E7<>\"N/A\" ),AND(G7>1,G7<>\"(seleccione o nível)\",E7<>\"N/A\")),\"Yes\",\"No\")","v":"No"},1]
[null,7,"1.1.2 Os organismos subcontratados (por exemplo, associações de produtores, trusts, cooperativas etc.) e agricultores estão cientes das políticas da empresa, incluindo se elas se aplicam a eles?",{"$f":"IF(OR(E8=\"\",E8=\"(seleccione a opção)\"),\"\",IF(VLOOKUP(E8,DropDowns!B:D,3,0)=0,\"\",VLOOKUP(E8,DropDowns!B:D,3,0)))","v":""},"(seleccione a opção)",null,"(seleccione o nível)",null,{"$f":"IF(OR(AND(D8<3,E8<>\"N/A\" ),AND(G8>1,G8<>\"(seleccione o nível)\",E8<>\"N/A\")),\"Yes\",\"No\")","v":"No"},1]
[null,8,"1.1.3 O direito à terra e as políticas da AISA são referenciados em documentos de governação corporativa e acordos entre os organismos subcontratados, os agricultores subcontratados e a empresa (por exemplo, estatutos, contratos de fornecimento de cana, etc.)?",{"$f":"IF(OR(E9=\"\",E9=\"(seleccione a opção)\"),\"\",IF(VLOOKUP(E9,DropDowns!B:D,3,0)=0,\"\",VLOOKUP(E9,DropDowns!B:D,3,0)))","v":""},"(seleccione a opção)",null,"(seleccione o nível)",null,"No",1]
[null,9,"1.1.4 As referências nos acordos entre os organismos subcontratados, os agricultores subcontratados e a empresa incluem quais ações a empresa tomará em resposta ao incumprimento (por exemplo, avisos, rescisão de contrato, etc.)?",{"$f":"IF(OR(E10=\"\",E10=\"(seleccione a opção)\"),\"\",IF(VLOOKUP(E10,DropDowns!B:D,3,0)=0,\"\",VLOOKUP(E10,DropDowns!B:D,3,0)))","v":""},"(seleccione a opção)",null,"(seleccione o nível)",null,"No",1]
{"$rows_left_out":317}
{"sheet":"Relatório do Fomento","index":5,"n_rows":200,"n_cols":12,"rows_kept":200,"cut":false,"hidden":false,"merged":[[1,1,1,11],[3,7,3,10]]}
[]
[null,"Relatório de Seguimento do Fomento"]
[]
[null,"Checklist Row","Item da Lista de Verificação","Secção (Título da Lista de Verificação Principal)","Estado/Ponto de Situação","Risco (1=baixo; 3=alto)","Esboço do Plano de Trabalho","Capacidade (Quem vai realizar as actividades do Plano de Trabalho)",null,null,null,"Cronograma / Roteiro"]
[null,{"$f":"IFERROR(INDEX('Lista de Verificação de Fomento'!$B$1:$B$396, SMALL(INDEX(('Lista de Verificação de Fomento'!$I$1:$I$396=\"Yes\")*(MATCH(ROW('Lista de Verificação de Fomento'!$I$1:$I$396), ROW('Lista de Verificação de Fomento'!$I$1:$I$396)))+('Lista de Verificação de Fomento'!$I$1:$I$396<>\"Yes\")*1048577, 0, 0), ROW(A1))),\"\")","v":""},{"$f":"IFERROR(VLOOKUP(B5,'Lista de Verificação de Fomento'!B:C,2,0),\"\")","v":""},{"$f":"IFERROR(VLOOKUP(VLOOKUP(B5,'Lista de Verificação de Fomento'!B:J,9,0),DropDowns!G:H,2,0),\"\")","v":""},{"$f":"IFERROR(VLOOKUP(B5,'Lista de Verificação de Fomento'!B:E,4,0),\"\")","v":""},{"$f":"IFERROR(VLOOKUP(B5,'Lista de Verificação de Fomento'!B:G,6,0),\"\")","v":""},null,{"$f":"IF(B5<>\"\",\"Interna:\",\"\")","v":""},null,{"$f":"IF(B5<>\"\",\"Externa:\",\"\")","v":""}]
[null,{"$f":"IFERROR(INDEX('Lista de Verificação de Fomento'!$B$1:$B$396, SMALL(INDEX(('Lista de Verificação de Fomento'!$I$1:$I$396=\"Yes\")*(MATCH(ROW('Lista de Verificação de Fomento'!$I$1:$I$396), ROW('Lista de Verificação de Fomento'!$I$1:$I$396)))+('Lista de Verificação de Fomento'!$I$1:$I$396<>\"Yes\")*1048577, 0, 0), ROW(A2))),\"\")","v":""},{"$f":"IFERROR(VLOOKUP(B6,'Lista de Verificação de Fomento'!B:C,2,0),\"\")","v":""},{"$f":"IFERROR(VLOOKUP(VLOOKUP(B6,'Lista de Verificação de Fomento'!B:J,9,0),DropDowns!G:H,2,0),\"\")","v":""},{"$f":"IFERROR(VLOOKUP(B6,'Lista de Verificação de Fomento'!B:E,4,0),\"\")","v":""},{"$f":"IFERROR(VLOOKUP(B6,'Lista de Verificação de Fomento'!B:G,6,0),\"\")","v":""},null,{"$f":"IF(B6<>\"\",\"Interna:\",\"\")","v":""},null,{"$f":"IF(B6<>\"\",\"Externa:\",\"\")","v":""}]
[null,{"$f":"IFERROR(INDEX('Lista de Verificação de Fomento'!$B$1:$B$396, SMALL(INDEX(('Lista de Verificação de Fomento'!$I$1:$I$396=\"Yes\")*(MATCH(ROW('Lista de Verificação de Fomento'!$I$1:$I$396), ROW('Lista de Verificação de Fomento'!$I$1:$I$396)))+('Lista de Verificação de Fomento'!$I$1:$I$396<>\"Yes\")*1048577, 0, 0), ROW(A3))),\"\")","v":""},{"$f":"IFERROR(VLOOKUP(B7,'Lista de Verificação de Fomento'!B:C,2,0),\"\")","v":""},{"$f":"IFERROR(VLOOKUP(VLOOKUP(B7,'Lista de Verificação de Fomento'!B:J,9,0),DropDowns!G:H,2,0),\"\")","v":""},{"$f":"IFERROR(VLOOKUP(B7,'Lista de Verificação de Fomento'!B:E,4,0),\"\")","v":""},{"$f":"IFERROR(VLOOKUP(B7,'Lista de Verificação de Fomento'!B:G,6,0),\"\")","v":""},null,"",null,""]
[null,{"$f":"IFERROR(INDEX('Lista de Verificação de Fomento'!$B$1:$B$396, SMALL(INDEX(('Lista de Verificação de Fomento'!$I$1:$I$396=\"Yes\")*(MATCH(ROW('Lista de Verificação de Fomento'!$I$1:$I$396), ROW('Lista de Verificação de Fomento'!$I$1:$I$396)))+('Lista de Verificação de Fomento'!$I$1:$I$396<>\"Yes\")*1048577, 0, 0), ROW(A4))),\"\")","v":""},{"$f":"IFERROR(VLOOKUP(B8,'Lista de Verificação de Fomento'!B:C,2,0),\"\")","v":""},{"$f":"IFERROR(VLOOKUP(VLOOKUP(B8,'Lista de Verificação de Fomento'!B:J,9,0),DropDowns!G:H,2,0),\"\")","v":""},{"$f":"IFERROR(VLOOKUP(B8,'Lista de Verificação de Fomento'!B:E,4,0),\"\")","v":""},{"$f":"IFERROR(VLOOKUP(B8,'Lista de Verificação de Fomento'!B:G,6,0),\"\")","v":""},null,"",null,""]
[null,{"$f":"IFERROR(INDEX('Lista de Verificação de Fomento'!$B$1:$B$396, SMALL(INDEX(('Lista de Verificação de Fomento'!$I$1:$I$396=\"Yes\")*(MATCH(ROW('Lista de Verificação de Fomento'!$I$1:$I$396), ROW('Lista de Verificação de Fomento'!$I$1:$I$396)))+('Lista de Verificação de Fomento'!$I$1:$I$396<>\"Yes\")*1048577, 0, 0), ROW(A5))),\"\")","v":""},{"$f":"IFERROR(VLOOKUP(B9,'Lista de Verificação de Fomento'!B:C,2,0),\"\")","v":""},{"$f":"IFERROR(VLOOKUP(VLOOKUP(B9,'Lista de Verificação de Fomento'!B:J,9,0),DropDowns!G:H,2,0),\"\")","v":""},{"$f":"IFERROR(VLOOKUP(B9,'Lista de Verificação de Fomento'!B:E,4,0),\"\")","v":""},{"$f":"IFERROR(VLOOKUP(B9,'Lista de Verificação de Fomento'!B:G,6,0),\"\")","v":""},null,"",null,""]
[null,{"$f":"IFERROR(INDEX('Lista de Verificação de Fomento'!$B$1:$B$396, SMALL(INDEX(('Lista de Verificação de Fomento'!$I$1:$I$396=\"Yes\")*(MATCH(ROW('Lista de Verificação de Fomento'!$I$1:$I$396), ROW('Lista de Verificação de Fomento'!$I$1:$I$396)))+('Lista de Verificação de Fomento'!$I$1:$I$396<>\"Yes\")*1048577, 0, 0), ROW(A6))),\"\")","v":""},{"$f":"IFERROR(VLOOKUP(B10,'Lista de Verificação de Fomento'!B:C,2,0),\"\")","v":""},{"$f":"IFERROR(VLOOKUP(VLOOKUP(B10,'Lista de Verificação de Fomento'!B:J,9,0),DropDowns!G:H,2,0),\"\")","v":""},{"$f":"IFERROR(VLOOKUP(B10,'Lista de Verificação de Fomento'!B:E,4,0),\"\")","v":""},{"$f":"IFERROR(VLOOKUP(B10,'Lista de Verificação de Fomento'!B:G,6,0),\"\")","v":""},null,"",null,""]
{"$rows_left_out":191}
{"sheet":"DropDowns","index":6,"n_rows":26,"n_cols":9,"rows_kept":26,"cut":false,"hidden":true,"merged":[]}
[]
[null,"Status %","Degree",null,"Risk",null,"Group Number","Estate Group Name","Outgrower Group Name"]
[null,"(seleccione a opção)","(select option)",null,"(seleccione o nível)",null,1,"Política Corporativa e Avaliação de Capacidade","Política de Fomento e Avaliação de Capacidade"]
[null,"< 25%","Little",1,1,null,2,"Revisão Legal, Administrativa e Institucional","Revisão Legal, Administrativa e Institucional"]
[null,"26 - 50%","Marginal",2,2,null,3,"Avaliações de Impacto","Avaliações de Impacto"]
[null,"51 - 75%","Substantial",3,3,null,4,"Consultas e Engajamento","Consulta e Engajamento"]
[null,"> 75%","Considerable",4,null,null,5,"Contratação e Acordos","Contratação e Acordos"]
[null,"N/A","Not Applicable",null,null,null,6,"Queixas, Reclamações e Respectivas Respostas","Queixas, Reclamações e Suas Respostas"]
[null,null,null,null,null,null,7,"Invasão"]
[null,null,null,null,null,null,8,"Mudança e Uso da Terra"]
{"$rows_left_out":16}