{"text_format":"1","workbook":"xlsx","n_sheets":7,"sheets":["Maelekezo-Miliki","Orodha ua uhakiki wa Miliki","Ripoti ya Miliki","Maelekezo-Kilimo cha mkataba","OUKIM","Ripoti ya kilimo cha mkataba","DropDowns"],"not_rendered":{"charts":0,"images":7,"macros":0,"external_links":0,"defined_names":6,"comments":0,"pivot_tables":0},"unopened":[],"bounds":{"document_bytes":16777216,"sheet_cells":100000,"rows_first":2000,"rows_last":500,"rows_between":2000,"halvings":0,"cell_chars":16384,"cell_head_chars":4096},"cells_cut":0,"cells_raw":0,"read":"whole","date_system":"1900"}

{"sheet":"Maelekezo-Miliki","index":0,"n_rows":39,"n_cols":2,"rows_kept":39,"cut":false,"hidden":false,"merged":[[1,1,1,16],[38,1,38,16]]}
[]
[null,"ZANA ZA UPIMAJI & MAELEKEZO YA KUINGIA   "]
[]
[]
[]
[]
[]
[]
[]
[]
[]
[]
[]
[]
[]
{"$rows_left_out":25}
{"sheet":"Orodha ua uhakiki wa Miliki","index":1,"n_rows":397,"n_cols":10,"rows_kept":397,"cut":false,"hidden":false,"merged":[]}
[]
[null,1,"Uhakiki wa Orodha ya Tathmini ",null,"Hali","Maoni & Uhifadhi wa Nyaraka ","Kihatarishi (1= ya chini ; 3= Ya juu)",null,"Report Ident","Group"]
[null,2]
[null,3,"I. Sera ya Shirika na Tathmini ya Uwezo  ",{"$f":"IF(COUNT(D6:D22)=0,\"\",ROUND(SUM(D6:D22)/COUNT(D6:D22),0))","v":""},null,null,{"$f":"IFERROR(ROUND(SUM(G5:G23)/COUNT(G5:G23),0),\"\")","v":""}]
[null,4]
[null,5,"1.1  Thathmini ya Sera "]
[null,6,"1.1.1  Je, shirika lina sera inayohusiana na uwekezaji wajibifu wa ardhi?  ",{"$f":"IF(OR(E7=\"\",E7=\"(chagua uchaguzi)\"),\"\",IF(VLOOKUP(E7,DropDowns!B:D,3,0)=0,\"\",VLOOKUP(E7,DropDowns!B:D,3,0)))","v":""},"(chagua uchaguzi)",null,"(chagua kiwango)",null,{"$f":"IF(OR(AND(D7<3,E7<>\"N/A\" ),AND(G7>1,G7<>\"(chagua kiwango)\",E7<>\"N/A\")),\"Yes\",\"No\")","v":"No"},1]
[null,7,"1.1.2 Ikiwa jibu ni ndiyo, je sera hiyo imekuwa ikitekelezwa au kuna mpango uliowekwa kwa ajili ya utekelezaji wa sera hiyo?   ",{"$f":"IF(OR(E8=\"\",E8=\"(chagua uchaguzi)\"),\"\",IF(VLOOKUP(E8,DropDowns!B:D,3,0)=0,\"\",VLOOKUP(E8,DropDowns!B:D,3,0)))","v":""},"(chagua uchaguzi)",null,"(chagua kiwango)",null,{"$f":"IF(OR(AND(D8<3,E8<>\"N/A\" ),AND(G8>1,G8<>\"(chagua kiwango)\",E8<>\"N/A\")),\"Yes\",\"No\")","v":"No"},1]
[null,8,"1.1.3 Je, shirika lina sera inayohusu haki za wanawake, ikiwa ni pamoja na haki za wanawake katika ardhi ",{"$f":"IF(OR(E9=\"\",E9=\"(chagua uchaguzi)\"),\"\",IF(VLOOKUP(E9,DropDowns!B:D,3,0)=0,\"\",VLOOKUP(E9,DropDowns!B:D,3,0)))","v":""},"(chagua uchaguzi)",null,"(chagua kiwango)",null,"No",1]
[null,9,"1.1.4  Ikiwa jibu ni ndiyo, je sera hiyo imekuwa ikitekelezwa au kuna mipango iliyowekwa kwa ajili ya utekelezaji wa sera hiyo?  ",{"$f":"IF(OR(E10=\"\",E10=\"(chagua uchaguzi)\"),\"\",IF(VLOOKUP(E10,DropDowns!B:D,3,0)=0,\"\",VLOOKUP(E10,DropDowns!B:D,3,0)))","v":""},"(chagua uchaguzi)",null,"(chagua kiwango)",null,"No",1]
[null,10,"1.1.5 Je, kampuni ina sera kuhusu namna ya kuendesha ESIAs ambayo inajumuisha upimaji wa athari za haki ya kumiliki ardhi, mazingira, mahusiano ya kijamii, usalama wa chakula, haki za binadamu, na haki za wanawake?  ",{"$f":"IF(OR(E11=\"\",E11=\"(chagua uchaguzi)\"),\"\",IF(VLOOKUP(E11,DropDowns!B:D,3,0)=0,\"\",VLOOKUP(E11,DropDowns!B:D,3,0)))","v":""},"(chagua uchaguzi)",null,"(chagua kiwango)",null,"No",1]
[null,11,"1.1.6 Je, kampuni ina sera ya uvumilivu sifuri wa rushwa?  ",{"$f":"IF(OR(E12=\"\",E12=\"(chagua uchaguzi)\"),\"\",IF(VLOOKUP(E12,DropDowns!B:D,3,0)=0,\"\",VLOOKUP(E12,DropDowns!B:D,3,0)))","v":""},"(chagua uchaguzi)",null,"(chagua kiwango)",null,"No",1]
[null,12,null,{"$f":"IF(OR(E13=\"\",E13=\"(select option)\"),\"\",VLOOKUP(E13,DropDowns!C:D,2,0))","v":""},null,null,null,null,"No",1]
[null,13,null,{"$f":"IF(OR(E14=\"\",E14=\"(select option)\"),\"\",VLOOKUP(E14,DropDowns!C:D,2,0))","v":""},null,null,null,null,"No",1]
[null,14,"1.2 Tathmini ya Uwezo  ",{"$f":"IF(OR(E15=\"\",E15=\"(select option)\"),\"\",VLOOKUP(E15,DropDowns!C:D,2,0))","v":""},null,null,null,null,"No",1]
{"$rows_left_out":383}
{"sheet":"Ripoti ya Miliki","index":2,"n_rows":200,"n_cols":12,"rows_kept":200,"cut":false,"hidden":false,"merged":[[3,7,3,10],[1,1,1,11]]}
[]
[null,"Ripoti ya Ufuatiliaji wa Miliki"]
[]
[null,"Checklist Row","Kipengee cha Orodha ya Uhakiki","Sehemu (Mada kuu ya orodha ya uhakiki) ","Hali  ","Vihatarishi (1=ya chini ; 3=ya juu )","Hatua za ufatiliaji ","Uwezo (Ni nani atakayeendesha shughuli za mpango kazi)  ",null,null,null,"Muda/Mipango  "]
[null,{"$f":"IFERROR(INDEX('Orodha ua uhakiki wa Miliki'!$B$1:$B$397, SMALL(INDEX(('Orodha ua uhakiki wa Miliki'!$I$1:$I$397=\"Yes\")*(MATCH(ROW('Orodha ua uhakiki wa Miliki'!$I$1:$I$397), ROW('Orodha ua uhakiki wa Miliki'!$I$1:$I$397)))+('Orodha ua uhakiki wa Miliki'!$I$1:$I$397<>\"Yes\")*1048577, 0, 0), ROW(A1))),\"\")","v":""},{"$f":"IFERROR(VLOOKUP(B5,'Orodha ua uhakiki wa Miliki'!B:C,2,0),\"\")","v":""},{"$f":"IFERROR(VLOOKUP(VLOOKUP(B5,'Orodha ua uhakiki wa Miliki'!B:J,9,0),DropDowns!G:H,2,0),\"\")","v":""},{"$f":"IFERROR(VLOOKUP(B5,'Orodha ua uhakiki wa Miliki'!B:E,4,0),\"\")","v":""},{"$f":"IFERROR(VLOOKUP(B5,'Orodha ua uhakiki wa Miliki'!B:G,6,0),\"\")","v":""},null,{"$f":"IF(B5<>\"\",\"Ya ndani:\",\"\")","v":""},null,{"$f":"IF(B5<>\"\",\"Ya nje:\",\"\")","v":""}]
[null,{"$f":"IFERROR(INDEX('Orodha ua uhakiki wa Miliki'!$B$1:$B$397, SMALL(INDEX(('Orodha ua uhakiki wa Miliki'!$I$1:$I$397=\"Yes\")*(MATCH(ROW('Orodha ua uhakiki wa Miliki'!$I$1:$I$397), ROW('Orodha ua uhakiki wa Miliki'!$I$1:$I$397)))+('Orodha ua uhakiki wa Miliki'!$I$1:$I$397<>\"Yes\")*1048577, 0, 0), ROW(A2))),\"\")","v":""},{"$f":"IFERROR(VLOOKUP(B6,'Orodha ua uhakiki wa Miliki'!B:C,2,0),\"\")","v":""},{"$f":"IFERROR(VLOOKUP(VLOOKUP(B6,'Orodha ua uhakiki wa Miliki'!B:J,9,0),DropDowns!G:H,2,0),\"\")","v":""},{"$f":"IFERROR(VLOOKUP(B6,'Orodha ua uhakiki wa Miliki'!B:E,4,0),\"\")","v":""},{"$f":"IFERROR(VLOOKUP(B6,'Orodha ua uhakiki wa Miliki'!B:G,6,0),\"\")","v":""},null,{"$f":"IF(B6<>\"\",\"Ya ndani:\",\"\")","v":""},null,{"$f":"IF(B6<>\"\",\"Ya nje:\",\"\")","v":""}]
[null,{"$f":"IFERROR(INDEX('Orodha ua uhakiki wa Miliki'!$B$1:$B$397, SMALL(INDEX(('Orodha ua uhakiki wa Miliki'!$I$1:$I$397=\"Yes\")*(MATCH(ROW('Orodha ua uhakiki wa Miliki'!$I$1:$I$397), ROW('Orodha ua uhakiki wa Miliki'!$I$1:$I$397)))+('Orodha ua uhakiki wa Miliki'!$I$1:$I$397<>\"Yes\")*1048577, 0, 0), ROW(A3))),\"\")","v":""},{"$f":"IFERROR(VLOOKUP(B7,'Orodha ua uhakiki wa Miliki'!B:C,2,0),\"\")","v":""},{"$f":"IFERROR(VLOOKUP(VLOOKUP(B7,'Orodha ua uhakiki wa Miliki'!B:J,9,0),DropDowns!G:H,2,0),\"\")","v":""},{"$f":"IFERROR(VLOOKUP(B7,'Orodha ua uhakiki wa Miliki'!B:E,4,0),\"\")","v":""},{"$f":"IFERROR(VLOOKUP(B7,'Orodha ua uhakiki wa Miliki'!B:G,6,0),\"\")","v":""},null,"",null,""]
[null,{"$f":"IFERROR(INDEX('Orodha ua uhakiki wa Miliki'!$B$1:$B$397, SMALL(INDEX(('Orodha ua uhakiki wa Miliki'!$I$1:$I$397=\"Yes\")*(MATCH(ROW('Orodha ua uhakiki wa Miliki'!$I$1:$I$397), ROW('Orodha ua uhakiki wa Miliki'!$I$1:$I$397)))+('Orodha ua uhakiki wa Miliki'!$I$1:$I$397<>\"Yes\")*1048577, 0, 0), ROW(A4))),\"\")","v":""},{"$f":"IFERROR(VLOOKUP(B8,'Orodha ua uhakiki wa Miliki'!B:C,2,0),\"\")","v":""},{"$f":"IFERROR(VLOOKUP(VLOOKUP(B8,'Orodha ua uhakiki wa Miliki'!B:J,9,0),DropDowns!G:H,2,0),\"\")","v":""},{"$f":"IFERROR(VLOOKUP(B8,'Orodha ua uhakiki wa Miliki'!B:E,4,0),\"\")","v":""},{"$f":"IFERROR(VLOOKUP(B8,'Orodha ua uhakiki wa Miliki'!B:G,6,0),\"\")","v":""},null,"",null,""]
[null,{"$f":"IFERROR(INDEX('Orodha ua uhakiki wa Miliki'!$B$1:$B$397, SMALL(INDEX(('Orodha ua uhakiki wa Miliki'!$I$1:$I$397=\"Yes\")*(MATCH(ROW('Orodha ua uhakiki wa Miliki'!$I$1:$I$397), ROW('Orodha ua uhakiki wa Miliki'!$I$1:$I$397)))+('Orodha ua uhakiki wa Miliki'!$I$1:$I$397<>\"Yes\")*1048577, 0, 0), ROW(A5))),\"\")","v":""},{"$f":"IFERROR(VLOOKUP(B9,'Orodha ua uhakiki wa Miliki'!B:C,2,0),\"\")","v":""},{"$f":"IFERROR(VLOOKUP(VLOOKUP(B9,'Orodha ua uhakiki wa Miliki'!B:J,9,0),DropDowns!G:H,2,0),\"\")","v":""},{"$f":"IFERROR(VLOOKUP(B9,'Orodha ua uhakiki wa Miliki'!B:E,4,0),\"\")","v":""},{"$f":"IFERROR(VLOOKUP(B9,'Orodha ua uhakiki wa Miliki'!B:G,6,0),\"\")","v":""},null,"",null,""]
[null,{"$f":"IFERROR(INDEX('Orodha ua uhakiki wa Miliki'!$B$1:$B$397, SMALL(INDEX(('Orodha ua uhakiki wa Miliki'!$I$1:$I$397=\"Yes\")*(MATCH(ROW('Orodha ua uhakiki wa Miliki'!$I$1:$I$397), ROW('Orodha ua uhakiki wa Miliki'!$I$1:$I$397)))+('Orodha ua uhakiki wa Miliki'!$I$1:$I$397<>\"Yes\")*1048577, 0, 0), ROW(A6))),\"\")","v":""},{"$f":"IFERROR(VLOOKUP(B10,'Orodha ua uhakiki wa Miliki'!B:C,2,0),\"\")","v":""},{"$f":"IFERROR(VLOOKUP(VLOOKUP(B10,'Orodha ua uhakiki wa Miliki'!B:J,9,0),DropDowns!G:H,2,0),\"\")","v":""},{"$f":"IFERROR(VLOOKUP(B10,'Orodha ua uhakiki wa Miliki'!B:E,4,0),\"\")","v":""},{"$f":"IFERROR(VLOOKUP(B10,'Orodha ua uhakiki wa Miliki'!B:G,6,0),\"\")","v":""},null,"",null,""]
[null,{"$f":"IFERROR(INDEX('Orodha ua uhakiki wa Miliki'!$B$1:$B$397, SMALL(INDEX(('Orodha ua uhakiki wa Miliki'!$I$1:$I$397=\"Yes\")*(MATCH(ROW('Orodha ua uhakiki wa Miliki'!$I$1:$I$397), ROW('Orodha ua uhakiki wa Miliki'!$I$1:$I$397)))+('Orodha ua uhakiki wa Miliki'!$I$1:$I$397<>\"Yes\")*1048577, 0, 0), ROW(A7))),\"\")","v":""},{"$f":"IFERROR(VLOOKUP(B11,'Orodha ua uhakiki wa Miliki'!B:C,2,0),\"\")","v":""},{"$f":"IFERROR(VLOOKUP(VLOOKUP(B11,'Orodha ua uhakiki wa Miliki'!B:J,9,0),DropDowns!G:H,2,0),\"\")","v":""},{"$f":"IFERROR(VLOOKUP(B11,'Orodha ua uhakiki wa Miliki'!B:E,4,0),\"\")","v":""},{"$f":"IFERROR(VLOOKUP(B11,'Orodha ua uhakiki wa Miliki'!B:G,6,0),\"\")","v":""},null,"",null,""]
[null,{"$f":"IFERROR(INDEX('Orodha ua uhakiki wa Miliki'!$B$1:$B$397, SMALL(INDEX(('Orodha ua uhakiki wa Miliki'!$I$1:$I$397=\"Yes\")*(MATCH(ROW('Orodha ua uhakiki wa Miliki'!$I$1:$I$397), ROW('Orodha ua uhakiki wa Miliki'!$I$1:$I$397)))+('Orodha ua uhakiki wa Miliki'!$I$1:$I$397<>\"Yes\")*1048577, 0, 0), ROW(A8))),\"\")","v":""},{"$f":"IFERROR(VLOOKUP(B12,'Orodha ua uhakiki wa Miliki'!B:C,2,0),\"\")","v":""},{"$f":"IFERROR(VLOOKUP(VLOOKUP(B12,'Orodha ua uhakiki wa Miliki'!B:J,9,0),DropDowns!G:H,2,0),\"\")","v":""},{"$f":"IFERROR(VLOOKUP(B12,'Orodha ua uhakiki wa Miliki'!B:E,4,0),\"\")","v":""},{"$f":"IFERROR(VLOOKUP(B12,'Orodha ua uhakiki wa Miliki'!B:G,6,0),\"\")","v":""},null,"",null,""]
[null,{"$f":"IFERROR(INDEX('Orodha ua uhakiki wa Miliki'!$B$1:$B$397, SMALL(INDEX(('Orodha ua uhakiki wa Miliki'!$I$1:$I$397=\"Yes\")*(MATCH(ROW('Orodha ua uhakiki wa Miliki'!$I$1:$I$397), ROW('Orodha ua uhakiki wa Miliki'!$I$1:$I$397)))+('Orodha ua uhakiki wa Miliki'!$I$1:$I$397<>\"Yes\")*1048577, 0, 0), ROW(A9))),\"\")","v":""},{"$f":"IFERROR(VLOOKUP(B13,'Orodha ua uhakiki wa Miliki'!B:C,2,0),\"\")","v":""},{"$f":"IFERROR(VLOOKUP(VLOOKUP(B13,'Orodha ua uhakiki wa Miliki'!B:J,9,0),DropDowns!G:H,2,0),\"\")","v":""},{"$f":"IFERROR(VLOOKUP(B13,'Orodha ua uhakiki wa Miliki'!B:E,4,0),\"\")","v":""},{"$f":"IFERROR(VLOOKUP(B13,'Orodha ua uhakiki wa Miliki'!B:G,6,0),\"\")","v":""},null,"",null,""]
[null,{"$f":"IFERROR(INDEX('Orodha ua uhakiki wa Miliki'!$B$1:$B$397, SMALL(INDEX(('Orodha ua uhakiki wa Miliki'!$I$1:$I$397=\"Yes\")*(MATCH(ROW('Orodha ua uhakiki wa Miliki'!$I$1:$I$397), ROW('Orodha ua uhakiki wa Miliki'!$I$1:$I$397)))+('Orodha ua uhakiki wa Miliki'!$I$1:$I$397<>\"Yes\")*1048577, 0, 0), ROW(A10))),\"\")","v":""},{"$f":"IFERROR(VLOOKUP(B14,'Orodha ua uhakiki wa Miliki'!B:C,2,0),\"\")","v":""},{"$f":"IFERROR(VLOOKUP(VLOOKUP(B14,'Orodha ua uhakiki wa Miliki'!B:J,9,0),DropDowns!G:H,2,0),\"\")","v":""},{"$f":"IFERROR(VLOOKUP(B14,'Orodha ua uhakiki wa Miliki'!B:E,4,0),\"\")","v":""},{"$f":"IFERROR(VLOOKUP(B14,'Orodha ua uhakiki wa Miliki'!B:G,6,0),\"\")","v":""},null,"",null,""]
[null,{"$f":"IFERROR(INDEX('Orodha ua uhakiki wa Miliki'!$B$1:$B$397, SMALL(INDEX(('Orodha ua uhakiki wa Miliki'!$I$1:$I$397=\"Yes\")*(MATCH(ROW('Orodha ua uhakiki wa Miliki'!$I$1:$I$397), ROW('Orodha ua uhakiki wa Miliki'!$I$1:$I$397)))+('Orodha ua uhakiki wa Miliki'!$I$1:$I$397<>\"Yes\")*1048577, 0, 0), ROW(A11))),\"\")","v":""},{"$f":"IFERROR(VLOOKUP(B15,'Orodha ua uhakiki wa Miliki'!B:C,2,0),\"\")","v":""},{"$f":"IFERROR(VLOOKUP(VLOOKUP(B15,'Orodha ua uhakiki wa Miliki'!B:J,9,0),DropDowns!G:H,2,0),\"\")","v":""},{"$f":"IFERROR(VLOOKUP(B15,'Orodha ua uhakiki wa Miliki'!B:E,4,0),\"\")","v":""},{"$f":"IFERROR(VLOOKUP(B15,'Orodha ua uhakiki wa Miliki'!B:G,6,0),\"\")","v":""},null,"",null,""]
{"$rows_left_out":186}
{"sheet":"Maelekezo-Kilimo cha mkataba","index":3,"n_rows":40,"n_cols":2,"rows_kept":40,"cut":false,"hidden":false,"merged":[[1,1,1,16],[38,1,38,16],[39,1,39,16]]}
[]
[null,"ZANA ZA UPIMAJI NA MAELEKEZO YA UINGIAJI"]
[]
[]
[]
[]
[]
[]
[]
[]
[]
[]
[]
[]
[]
{"$rows_left_out":26}
{"sheet":"OUKIM","index":4,"n_rows":326,"n_cols":10,"rows_kept":326,"cut":false,"hidden":false,"merged":[]}
[]
[null,1,"Orodha ya Tathmini   ",null,"Hali","Maoni & Uhifadhi wa nyaraka  ","Kihatarishi (1=ya chini; 3= ya juu  )",null,"Report Ident","Group"]
[null,2]
[null,3,"I. Tathmini ya Sera ya Kilimo cha Mkataba na Uwezo  ",{"$f":"IF(COUNT(D5:D19)=0,\"\",ROUND(SUM(D5:D19)/COUNT(D5:D19),0))","v":""},null,null,{"$f":"IFERROR(ROUND(SUM(G5:G18)/COUNT(G5:G18),0),\"\")","v":""}]
[null,null,null,{"$f":"IF(OR(E5=\"\",E5=\"(select option)\"),\"\",VLOOKUP(E5,DropDowns!C:D,2,0))","v":""}]
[null,5,"1.1 Sera ya Kilimo cha Mkataba  "]
[null,6,"1.1.1 Je, haki ya ardhi ya kampuni na sera ya ESIA zinafanya kazi kwenye mpango wa kilimo cha mkataba au mbinu zingine mbadala za kibiashara (kama nyongeza ya ardhi inayomilikiwa, kukodiwa au kutumiwa na kampuni)  ",{"$f":"IF(OR(E7=\"\",E7=\"(chagua uchaguzi)\"),\"\",IF(VLOOKUP(E7,DropDowns!B:D,3,0)=0,\"\",VLOOKUP(E7,DropDowns!B:D,3,0)))","v":""},"(chagua uchaguzi)",null,"(chagua kiwango)",null,{"$f":"IF(OR(AND(D7<3,E7<>\"N/A\" ),AND(G7>1,G7<>\"(chagua kiwango)\",E7<>\"N/A\")),\"Yes\",\"No\")","v":"No"},1]
[null,7,"1.1.2 Are outgrower bodies (e.g., outgrower associations, trusts, cooperatives, etc.) and farmers aware of the company’s policies, including whether they apply to them?",{"$f":"IF(OR(E8=\"\",E8=\"(chagua uchaguzi)\"),\"\",IF(VLOOKUP(E8,DropDowns!B:D,3,0)=0,\"\",VLOOKUP(E8,DropDowns!B:D,3,0)))","v":""},"(chagua uchaguzi)",null,"(chagua kiwango)",null,{"$f":"IF(OR(AND(D8<3,E8<>\"N/A\" ),AND(G8>1,G8<>\"(chagua kiwango)\",E8<>\"N/A\")),\"Yes\",\"No\")","v":"No"},1]
[null,8,"1.1.3 Je, kuna Haki za ardhi na sera za ESIA zilizotajwa katika nyaraka za serikali na makubaliano baina ya mihimili ya kilimo cha mkataba, wakulima wa kilimo cha mkataba na mikataba ya kampuni (kwa mfano, sheria ndogo ndogo, mikataba ya utafutaji wa miwa nk)?",{"$f":"IF(OR(E9=\"\",E9=\"(chagua uchaguzi)\"),\"\",IF(VLOOKUP(E9,DropDowns!B:D,3,0)=0,\"\",VLOOKUP(E9,DropDowns!B:D,3,0)))","v":""},"(chagua uchaguzi)",null,"(chagua kiwango)",null,"No",1]
[null,9,"1.1.4  Je, marejeo ya mikataba baina ya mihimili ya kilimo cha mkataba, wakulima wa kilimo cha mkataba, na kampuni hujumuisha hatua ambazo kampuni itachukua katika kukabiliana na vitendo visivyotii masharti ya mkataba (kwa mfano, onyo, kusitisha mkataba, nk)?",{"$f":"IF(OR(E10=\"\",E10=\"(chagua uchaguzi)\"),\"\",IF(VLOOKUP(E10,DropDowns!B:D,3,0)=0,\"\",VLOOKUP(E10,DropDowns!B:D,3,0)))","v":""},"(chagua uchaguzi)",null,"(chagua kiwango)",null,"No",1]
[null,10,"1.1.5 Je, mpango wa kilimo cha mkataba cha kampuni unashughulika na namna ya kuhamasisha vyombo vya kilimo cha mkataba na wakulima juu ya haki ardhi yake na  sera ya ESIA?",{"$f":"IF(OR(E11=\"\",E11=\"(chagua uchaguzi)\"),\"\",IF(VLOOKUP(E11,DropDowns!B:D,3,0)=0,\"\",VLOOKUP(E11,DropDowns!B:D,3,0)))","v":""},"(chagua uchaguzi)",null,"(chagua kiwango)",null,"No",1]
[null,11,"1.1.6 Je, mpango wa kilimo cha mkataba unaonesha jinsi utakavyoshughulika katika kuvihamasisha na kuvifanya vyombo vya kilimo cha mkataba na wakulima waweze kutii sheria kwa kukubaliana na haki zake za ardhi na sera ya ESIA?",{"$f":"IF(OR(E12=\"\",E12=\"(chagua uchaguzi)\"),\"\",IF(VLOOKUP(E12,DropDowns!B:D,3,0)=0,\"\",VLOOKUP(E12,DropDowns!B:D,3,0)))","v":""},"(chagua uchaguzi)",null,"(chagua kiwango)",null,"No",1]
[null,12,null,{"$f":"IF(OR(E13=\"\",E13=\"(select option)\"),\"\",VLOOKUP(E13,DropDowns!C:D,2,0))","v":""},null,null,null,null,"No",1]
[null,13,null,{"$f":"IF(OR(E14=\"\",E14=\"(select option)\"),\"\",VLOOKUP(E14,DropDowns!C:D,2,0))","v":""},null,null,null,null,"No",1]
[null,14,"1.2 Uwezo wa Wafanyakazi  ",{"$f":"IF(OR(E15=\"\",E15=\"(select option)\"),\"\",VLOOKUP(E15,DropDowns!C:D,2,0))","v":""},null,null,null,null,"No",1]
{"$rows_left_out":312}
{"sheet":"Ripoti ya kilimo cha mkataba","index":5,"n_rows":200,"n_cols":12,"rows_kept":200,"cut":false,"hidden":false,"merged":[[1,1,1,11],[3,7,3,10]]}
[]
[null,"Ripoti ya kilimo cha mkataba"]
[]
[null,"Checklist Row","Kipengee cha orodha ya uhakiki","Sehemu  (mada kuu ya orodha ya uhakiki)","Hali","Vihatarishi (1=hya chini; 3=ya juu )","Muhtasari wa mpango kazi  ","Uwezo (Ni nani atakayefanya shughuli za mpango kazi)",null,null,null,"Ratiba/ mpango kazi  "]
[null,{"$f":"IFERROR(INDEX(OUKIM!$B$1:$B$396, SMALL(INDEX((OUKIM!$I$1:$I$396=\"Yes\")*(MATCH(ROW(OUKIM!$I$1:$I$396), ROW(OUKIM!$I$1:$I$396)))+(OUKIM!$I$1:$I$396<>\"Yes\")*1048577, 0, 0), ROW(A1))),\"\")","v":""},{"$f":"IFERROR(VLOOKUP(B5,OUKIM!B:C,2,0),\"\")","v":""},{"$f":"IFERROR(VLOOKUP(VLOOKUP(B5,OUKIM!B:J,9,0),DropDowns!G:I,3,0),\"\")","v":""},{"$f":"IFERROR(VLOOKUP(B5,OUKIM!B:E,4,0),\"\")","v":""},{"$f":"IFERROR(VLOOKUP(B5,OUKIM!B:G,6,0),\"\")","v":""},null,{"$f":"IF(B5<>\"\",\"Ya ndani:\",\"\")","v":""},null,{"$f":"IF(B5<>\"\",\"Ya nje:\",\"\")","v":""}]
[null,{"$f":"IFERROR(INDEX(OUKIM!$B$1:$B$396, SMALL(INDEX((OUKIM!$I$1:$I$396=\"Yes\")*(MATCH(ROW(OUKIM!$I$1:$I$396), ROW(OUKIM!$I$1:$I$396)))+(OUKIM!$I$1:$I$396<>\"Yes\")*1048577, 0, 0), ROW(A2))),\"\")","v":""},{"$f":"IFERROR(VLOOKUP(B6,OUKIM!B:C,2,0),\"\")","v":""},{"$f":"IFERROR(VLOOKUP(VLOOKUP(B6,OUKIM!B:J,9,0),DropDowns!G:I,3,0),\"\")","v":""},{"$f":"IFERROR(VLOOKUP(B6,OUKIM!B:E,4,0),\"\")","v":""},{"$f":"IFERROR(VLOOKUP(B6,OUKIM!B:G,6,0),\"\")","v":""},null,{"$f":"IF(B6<>\"\",\"Ya ndani:\",\"\")","v":""},null,{"$f":"IF(B6<>\"\",\"Ya nje:\",\"\")","v":""}]
[null,{"$f":"IFERROR(INDEX(OUKIM!$B$1:$B$396, SMALL(INDEX((OUKIM!$I$1:$I$396=\"Yes\")*(MATCH(ROW(OUKIM!$I$1:$I$396), ROW(OUKIM!$I$1:$I$396)))+(OUKIM!$I$1:$I$396<>\"Yes\")*1048577, 0, 0), ROW(A3))),\"\")","v":""},{"$f":"IFERROR(VLOOKUP(B7,OUKIM!B:C,2,0),\"\")","v":""},{"$f":"IFERROR(VLOOKUP(VLOOKUP(B7,OUKIM!B:J,9,0),DropDowns!G:I,3,0),\"\")","v":""},{"$f":"IFERROR(VLOOKUP(B7,OUKIM!B:E,4,0),\"\")","v":""},{"$f":"IFERROR(VLOOKUP(B7,OUKIM!B:G,6,0),\"\")","v":""},null,"",null,""]
[null,{"$f":"IFERROR(INDEX(OUKIM!$B$1:$B$396, SMALL(INDEX((OUKIM!$I$1:$I$396=\"Yes\")*(MATCH(ROW(OUKIM!$I$1:$I$396), ROW(OUKIM!$I$1:$I$396)))+(OUKIM!$I$1:$I$396<>\"Yes\")*1048577, 0, 0), ROW(A4))),\"\")","v":""},{"$f":"IFERROR(VLOOKUP(B8,OUKIM!B:C,2,0),\"\")","v":""},{"$f":"IFERROR(VLOOKUP(VLOOKUP(B8,OUKIM!B:J,9,0),DropDowns!G:I,3,0),\"\")","v":""},{"$f":"IFERROR(VLOOKUP(B8,OUKIM!B:E,4,0),\"\")","v":""},{"$f":"IFERROR(VLOOKUP(B8,OUKIM!B:G,6,0),\"\")","v":""},null,"",null,""]
[null,{"$f":"IFERROR(INDEX(OUKIM!$B$1:$B$396, SMALL(INDEX((OUKIM!$I$1:$I$396=\"Yes\")*(MATCH(ROW(OUKIM!$I$1:$I$396), ROW(OUKIM!$I$1:$I$396)))+(OUKIM!$I$1:$I$396<>\"Yes\")*1048577, 0, 0), ROW(A5))),\"\")","v":""},{"$f":"IFERROR(VLOOKUP(B9,OUKIM!B:C,2,0),\"\")","v":""},{"$f":"IFERROR(VLOOKUP(VLOOKUP(B9,OUKIM!B:J,9,0),DropDowns!G:I,3,0),\"\")","v":""},{"$f":"IFERROR(VLOOKUP(B9,OUKIM!B:E,4,0),\"\")","v":""},{"$f":"IFERROR(VLOOKUP(B9,OUKIM!B:G,6,0),\"\")","v":""},null,"",null,""]
[null,{"$f":"IFERROR(INDEX(OUKIM!$B$1:$B$396, SMALL(INDEX((OUKIM!$I$1:$I$396=\"Yes\")*(MATCH(ROW(OUKIM!$I$1:$I$396), ROW(OUKIM!$I$1:$I$396)))+(OUKIM!$I$1:$I$396<>\"Yes\")*1048577, 0, 0), ROW(A6))),\"\")","v":""},{"$f":"IFERROR(VLOOKUP(B10,OUKIM!B:C,2,0),\"\")","v":""},{"$f":"IFERROR(VLOOKUP(VLOOKUP(B10,OUKIM!B:J,9,0),DropDowns!G:I,3,0),\"\")","v":""},{"$f":"IFERROR(VLOOKUP(B10,OUKIM!B:E,4,0),\"\")","v":""},{"$f":"IFERROR(VLOOKUP(B10,OUKIM!B:G,6,0),\"\")","v":""},null,"",null,""]
[null,{"$f":"IFERROR(INDEX(OUKIM!$B$1:$B$396, SMALL(INDEX((OUKIM!$I$1:$I$396=\"Yes\")*(MATCH(ROW(OUKIM!$I$1:$I$396), ROW(OUKIM!$I$1:$I$396)))+(OUKIM!$I$1:$I$396<>\"Yes\")*1048577, 0, 0), ROW(A7))),\"\")","v":""},{"$f":"IFERROR(VLOOKUP(B11,OUKIM!B:C,2,0),\"\")","v":""},{"$f":"IFERROR(VLOOKUP(VLOOKUP(B11,OUKIM!B:J,9,0),DropDowns!G:I,3,0),\"\")","v":""},{"$f":"IFERROR(VLOOKUP(B11,OUKIM!B:E,4,0),\"\")","v":""},{"$f":"IFERROR(VLOOKUP(B11,OUKIM!B:G,6,0),\"\")","v":""},null,"",null,""]
[null,{"$f":"IFERROR(INDEX(OUKIM!$B$1:$B$396, SMALL(INDEX((OUKIM!$I$1:$I$396=\"Yes\")*(MATCH(ROW(OUKIM!$I$1:$I$396), ROW(OUKIM!$I$1:$I$396)))+(OUKIM!$I$1:$I$396<>\"Yes\")*1048577, 0, 0), ROW(A8))),\"\")","v":""},{"$f":"IFERROR(VLOOKUP(B12,OUKIM!B:C,2,0),\"\")","v":""},{"$f":"IFERROR(VLOOKUP(VLOOKUP(B12,OUKIM!B:J,9,0),DropDowns!G:I,3,0),\"\")","v":""},{"$f":"IFERROR(VLOOKUP(B12,OUKIM!B:E,4,0),\"\")","v":""},{"$f":"IFERROR(VLOOKUP(B12,OUKIM!B:G,6,0),\"\")","v":""},null,"",null,""]
[null,{"$f":"IFERROR(INDEX(OUKIM!$B$1:$B$396, SMALL(INDEX((OUKIM!$I$1:$I$396=\"Yes\")*(MATCH(ROW(OUKIM!$I$1:$I$396), ROW(OUKIM!$I$1:$I$396)))+(OUKIM!$I$1:$I$396<>\"Yes\")*1048577, 0, 0), ROW(A9))),\"\")","v":""},{"$f":"IFERROR(VLOOKUP(B13,OUKIM!B:C,2,0),\"\")","v":""},{"$f":"IFERROR(VLOOKUP(VLOOKUP(B13,OUKIM!B:J,9,0),DropDowns!G:I,3,0),\"\")","v":""},{"$f":"IFERROR(VLOOKUP(B13,OUKIM!B:E,4,0),\"\")","v":""},{"$f":"IFERROR(VLOOKUP(B13,OUKIM!B:G,6,0),\"\")","v":""},null,"",null,""]
[null,{"$f":"IFERROR(INDEX(OUKIM!$B$1:$B$396, SMALL(INDEX((OUKIM!$I$1:$I$396=\"Yes\")*(MATCH(ROW(OUKIM!$I$1:$I$396), ROW(OUKIM!$I$1:$I$396)))+(OUKIM!$I$1:$I$396<>\"Yes\")*1048577, 0, 0), ROW(A10))),\"\")","v":""},{"$f":"IFERROR(VLOOKUP(B14,OUKIM!B:C,2,0),\"\")","v":""},{"$f":"IFERROR(VLOOKUP(VLOOKUP(B14,OUKIM!B:J,9,0),DropDowns!G:I,3,0),\"\")","v":""},{"$f":"IFERROR(VLOOKUP(B14,OUKIM!B:E,4,0),\"\")","v":""},{"$f":"IFERROR(VLOOKUP(B14,OUKIM!B:G,6,0),\"\")","v":""},null,"",null,""]
[null,{"$f":"IFERROR(INDEX(OUKIM!$B$1:$B$396, SMALL(INDEX((OUKIM!$I$1:$I$396=\"Yes\")*(MATCH(ROW(OUKIM!$I$1:$I$396), ROW(OUKIM!$I$1:$I$396)))+(OUKIM!$I$1:$I$396<>\"Yes\")*1048577, 0, 0), ROW(A11))),\"\")","v":""},{"$f":"IFERROR(VLOOKUP(B15,OUKIM!B:C,2,0),\"\")","v":""},{"$f":"IFERROR(VLOOKUP(VLOOKUP(B15,OUKIM!B:J,9,0),DropDowns!G:I,3,0),\"\")","v":""},{"$f":"IFERROR(VLOOKUP(B15,OUKIM!B:E,4,0),\"\")","v":""},{"$f":"IFERROR(VLOOKUP(B15,OUKIM!B:G,6,0),\"\")","v":""},null,"",null,""]
{"$rows_left_out":186}
{"sheet":"DropDowns","index":6,"n_rows":26,"n_cols":9,"rows_kept":26,"cut":false,"hidden":true,"merged":[]}
[]
[null,"Status %","Degree",null,"Risk",null,"Group Number","Estate Group Name","Outgrower Group Name"]
[null,"(chagua uchaguzi)","(select option)",null,"(chagua kiwango)",null,1,"Sera ya Shirika na Tathmini ya Uwezo  ","Tathmini ya Sera ya Kilimo cha Mkataba na Uwezo "]
[null,"< 25%","Little",1,1,null,2,"Uhakiki wa Kisheria, kiutawala na kitaasisi ","Uhakiki wa Kisheria, Kiutawala na Kitaasisi "]
[null,"26 - 50%","Marginal",2,2,null,3,"Tathmini ya Athari","Tathmini ya Athari "]
[null,"51 - 75%","Substantial",3,3,null,4,"Mashauriano na Ushirikiano","Mashauriano na Ushirikiano "]
[null,"> 75%","Considerable",4,null,null,5,"Uingiaji Mkataba na Makubaliano","Uingiaji Mkataba na Makubaliano "]
[null,"N/A","Not Applicable",null,null,null,6,"Malalamiko & Mrejesho ","Malalamiko & Mrejesho"]
[null,null,null,null,null,null,7,"Uvamizi"]
[null,null,null,null,null,null,8,"Mabadiliko ya Matumizi ya ardhi"]
[]
[]
[]
[]
[]
{"$rows_left_out":11}