{"text_format":"1","workbook":"xlsx","n_sheets":7,"sheets":["Instructions - Estate","Estate Checklist","Estate Report","Instructions - Outgrower","Outgrower Checklist","Outgrower Report","DropDowns"],"not_rendered":{"charts":0,"images":7,"macros":0,"external_links":0,"defined_names":6,"comments":0,"pivot_tables":0},"unopened":[],"bounds":{"document_bytes":16777216,"sheet_cells":100000,"rows_first":2000,"rows_last":500,"rows_between":2000,"halvings":0,"cell_chars":16384,"cell_head_chars":4096},"cells_cut":0,"cells_raw":0,"read":"whole","date_system":"1900"}

{"sheet":"Instructions - Estate","index":0,"n_rows":40,"n_cols":2,"rows_kept":40,"cut":false,"hidden":false,"merged":[[1,1,1,16],[39,1,39,16],[38,1,38,16]]}
[]
[null,"TOOL NAVIGATION & ENTRY INSTRUCTIONS"]
[]
[]
[]
[]
[]
[]
[]
[]
[]
[]
[]
[]
[]
{"$rows_left_out":26}
{"sheet":"Estate Checklist","index":1,"n_rows":397,"n_cols":10,"rows_kept":397,"cut":false,"hidden":false,"merged":[]}
[]
[null,1,"Evaluation Checklists",null,"Status","Comments & Documentation","Risk (1=low; 3=high)",null,"Report Ident","Group"]
[null,2]
[null,3,"I. Corporate Policy and Capacity Assessment",{"$f":"IF(COUNT(D6:D22)=0,\"\",ROUND(SUM(D6:D22)/COUNT(D6:D22),0))","v":""},null,null,{"$f":"IFERROR(ROUND(SUM(G5:G23)/COUNT(G5:G23),0),\"\")","v":""}]
[null,4]
[null,5,"1.1 Policy Assessment"]
[null,6,"1.1.1 Does the company have a policy relating to responsible land-based investments?",{"$f":"IF(OR(E7=\"\",E7=\"(select option)\"),\"\",IF(VLOOKUP(E7,DropDowns!B:D,3,0)=0,\"\",VLOOKUP(E7,DropDowns!B:D,3,0)))","v":""},"(select option)",null,"(select level)",null,{"$f":"IF(OR(AND(D7<3,E7<>\"N/A\" ),AND(G7>1,G7<>\"(select level)\",E7<>\"N/A\")),\"Yes\",\"No\")","v":"No"},1]
[null,7,"1.1.2 If so, has the policy been implemented or does it have a plan in place for the implementation of the policy?",{"$f":"IF(OR(E8=\"\",E8=\"(select option)\"),\"\",IF(VLOOKUP(E8,DropDowns!B:D,3,0)=0,\"\",VLOOKUP(E8,DropDowns!B:D,3,0)))","v":""},"(select option)",null,"(select level)",null,{"$f":"IF(OR(AND(D8<3,E8<>\"N/A\" ),AND(G8>1,G8<>\"(select level)\",E8<>\"N/A\")),\"Yes\",\"No\")","v":"No"},1]
[null,8,"1.1.3 Does the company have a policy relating to women's rights, including women's rights to land?",{"$f":"IF(OR(E9=\"\",E9=\"(select option)\"),\"\",IF(VLOOKUP(E9,DropDowns!B:D,3,0)=0,\"\",VLOOKUP(E9,DropDowns!B:D,3,0)))","v":""},"(select option)",null,"(select level)",null,"No",1]
[null,9,"1.1.4 If so, has the policy been implemented or does it have a plan in place for the implementation of the policy?",{"$f":"IF(OR(E10=\"\",E10=\"(select option)\"),\"\",IF(VLOOKUP(E10,DropDowns!B:D,3,0)=0,\"\",VLOOKUP(E10,DropDowns!B:D,3,0)))","v":""},"(select option)",null,"(select level)",null,"No",1]
[null,10,"1.1.5 Does the company have a policy on how to carry out ESIAs that includes measuring impacts on land tenure security, the environment, social relations, food security, human rights, and women's rights?",{"$f":"IF(OR(E11=\"\",E11=\"(select option)\"),\"\",IF(VLOOKUP(E11,DropDowns!B:D,3,0)=0,\"\",VLOOKUP(E11,DropDowns!B:D,3,0)))","v":""},"(select option)",null,"(select level)",null,"No",1]
[null,11,"1.1.6 Does the company have a ‘zero tolerance’ policy on corruption?",{"$f":"IF(OR(E12=\"\",E12=\"(select option)\"),\"\",IF(VLOOKUP(E12,DropDowns!B:D,3,0)=0,\"\",VLOOKUP(E12,DropDowns!B:D,3,0)))","v":""},"(select option)",null,"(select level)",null,"No",1]
[null,12,null,{"$f":"IF(OR(E13=\"\",E13=\"(select option)\"),\"\",VLOOKUP(E13,DropDowns!C:D,2,0))","v":""},null,null,null,null,"No",1]
[null,13,null,{"$f":"IF(OR(E14=\"\",E14=\"(select option)\"),\"\",VLOOKUP(E14,DropDowns!C:D,2,0))","v":""},null,null,null,null,"No",1]
[null,14,"1.2 Capacity Assessment",{"$f":"IF(OR(E15=\"\",E15=\"(select option)\"),\"\",VLOOKUP(E15,DropDowns!C:D,2,0))","v":""},null,null,null,null,"No",1]
{"$rows_left_out":383}
{"sheet":"Estate Report","index":2,"n_rows":200,"n_cols":12,"rows_kept":200,"cut":false,"hidden":false,"merged":[[3,7,3,10],[1,1,1,11]]}
[]
[null,"Estate Follow-Up Report"]
[]
[null,"Checklist Row","Checklist Item","Section (Main Checklist Title)","Status","Risk (1=low; 3=high)","Follow-Up Actions","Capacity (Who Will Carry Out Workplan Activities)",null,null,null,"Timeline/Road Map"]
[null,{"$f":"IFERROR(INDEX('Estate Checklist'!$B$1:$B$397, SMALL(INDEX(('Estate Checklist'!$I$1:$I$397=\"Yes\")*(MATCH(ROW('Estate Checklist'!$I$1:$I$397), ROW('Estate Checklist'!$I$1:$I$397)))+('Estate Checklist'!$I$1:$I$397<>\"Yes\")*1048577, 0, 0), ROW(A1))),\"\")","v":""},{"$f":"IFERROR(VLOOKUP(B5,'Estate Checklist'!B:C,2,0),\"\")","v":""},{"$f":"IFERROR(VLOOKUP(VLOOKUP(B5,'Estate Checklist'!B:J,9,0),DropDowns!G:H,2,0),\"\")","v":""},{"$f":"IFERROR(VLOOKUP(B5,'Estate Checklist'!B:E,4,0),\"\")","v":""},{"$f":"IFERROR(VLOOKUP(B5,'Estate Checklist'!B:G,6,0),\"\")","v":""},null,{"$f":"IF(B5<>\"\",\"Internal:\",\"\")","v":""},null,{"$f":"IF(B5<>\"\",\"External:\",\"\")","v":""}]
[null,{"$f":"IFERROR(INDEX('Estate Checklist'!$B$1:$B$397, SMALL(INDEX(('Estate Checklist'!$I$1:$I$397=\"Yes\")*(MATCH(ROW('Estate Checklist'!$I$1:$I$397), ROW('Estate Checklist'!$I$1:$I$397)))+('Estate Checklist'!$I$1:$I$397<>\"Yes\")*1048577, 0, 0), ROW(A2))),\"\")","v":""},{"$f":"IFERROR(VLOOKUP(B6,'Estate Checklist'!B:C,2,0),\"\")","v":""},{"$f":"IFERROR(VLOOKUP(VLOOKUP(B6,'Estate Checklist'!B:J,9,0),DropDowns!G:H,2,0),\"\")","v":""},{"$f":"IFERROR(VLOOKUP(B6,'Estate Checklist'!B:E,4,0),\"\")","v":""},{"$f":"IFERROR(VLOOKUP(B6,'Estate Checklist'!B:G,6,0),\"\")","v":""},null,{"$f":"IF(B6<>\"\",\"Internal:\",\"\")","v":""},null,{"$f":"IF(B6<>\"\",\"External:\",\"\")","v":""}]
[null,{"$f":"IFERROR(INDEX('Estate Checklist'!$B$1:$B$397, SMALL(INDEX(('Estate Checklist'!$I$1:$I$397=\"Yes\")*(MATCH(ROW('Estate Checklist'!$I$1:$I$397), ROW('Estate Checklist'!$I$1:$I$397)))+('Estate Checklist'!$I$1:$I$397<>\"Yes\")*1048577, 0, 0), ROW(A3))),\"\")","v":""},{"$f":"IFERROR(VLOOKUP(B7,'Estate Checklist'!B:C,2,0),\"\")","v":""},{"$f":"IFERROR(VLOOKUP(VLOOKUP(B7,'Estate Checklist'!B:J,9,0),DropDowns!G:H,2,0),\"\")","v":""},{"$f":"IFERROR(VLOOKUP(B7,'Estate Checklist'!B:E,4,0),\"\")","v":""},{"$f":"IFERROR(VLOOKUP(B7,'Estate Checklist'!B:G,6,0),\"\")","v":""},null,"",null,""]
[null,{"$f":"IFERROR(INDEX('Estate Checklist'!$B$1:$B$397, SMALL(INDEX(('Estate Checklist'!$I$1:$I$397=\"Yes\")*(MATCH(ROW('Estate Checklist'!$I$1:$I$397), ROW('Estate Checklist'!$I$1:$I$397)))+('Estate Checklist'!$I$1:$I$397<>\"Yes\")*1048577, 0, 0), ROW(A4))),\"\")","v":""},{"$f":"IFERROR(VLOOKUP(B8,'Estate Checklist'!B:C,2,0),\"\")","v":""},{"$f":"IFERROR(VLOOKUP(VLOOKUP(B8,'Estate Checklist'!B:J,9,0),DropDowns!G:H,2,0),\"\")","v":""},{"$f":"IFERROR(VLOOKUP(B8,'Estate Checklist'!B:E,4,0),\"\")","v":""},{"$f":"IFERROR(VLOOKUP(B8,'Estate Checklist'!B:G,6,0),\"\")","v":""},null,"",null,""]
[null,{"$f":"IFERROR(INDEX('Estate Checklist'!$B$1:$B$397, SMALL(INDEX(('Estate Checklist'!$I$1:$I$397=\"Yes\")*(MATCH(ROW('Estate Checklist'!$I$1:$I$397), ROW('Estate Checklist'!$I$1:$I$397)))+('Estate Checklist'!$I$1:$I$397<>\"Yes\")*1048577, 0, 0), ROW(A5))),\"\")","v":""},{"$f":"IFERROR(VLOOKUP(B9,'Estate Checklist'!B:C,2,0),\"\")","v":""},{"$f":"IFERROR(VLOOKUP(VLOOKUP(B9,'Estate Checklist'!B:J,9,0),DropDowns!G:H,2,0),\"\")","v":""},{"$f":"IFERROR(VLOOKUP(B9,'Estate Checklist'!B:E,4,0),\"\")","v":""},{"$f":"IFERROR(VLOOKUP(B9,'Estate Checklist'!B:G,6,0),\"\")","v":""},null,"",null,""]
[null,{"$f":"IFERROR(INDEX('Estate Checklist'!$B$1:$B$397, SMALL(INDEX(('Estate Checklist'!$I$1:$I$397=\"Yes\")*(MATCH(ROW('Estate Checklist'!$I$1:$I$397), ROW('Estate Checklist'!$I$1:$I$397)))+('Estate Checklist'!$I$1:$I$397<>\"Yes\")*1048577, 0, 0), ROW(A6))),\"\")","v":""},{"$f":"IFERROR(VLOOKUP(B10,'Estate Checklist'!B:C,2,0),\"\")","v":""},{"$f":"IFERROR(VLOOKUP(VLOOKUP(B10,'Estate Checklist'!B:J,9,0),DropDowns!G:H,2,0),\"\")","v":""},{"$f":"IFERROR(VLOOKUP(B10,'Estate Checklist'!B:E,4,0),\"\")","v":""},{"$f":"IFERROR(VLOOKUP(B10,'Estate Checklist'!B:G,6,0),\"\")","v":""},null,"",null,""]
[null,{"$f":"IFERROR(INDEX('Estate Checklist'!$B$1:$B$397, SMALL(INDEX(('Estate Checklist'!$I$1:$I$397=\"Yes\")*(MATCH(ROW('Estate Checklist'!$I$1:$I$397), ROW('Estate Checklist'!$I$1:$I$397)))+('Estate Checklist'!$I$1:$I$397<>\"Yes\")*1048577, 0, 0), ROW(A7))),\"\")","v":""},{"$f":"IFERROR(VLOOKUP(B11,'Estate Checklist'!B:C,2,0),\"\")","v":""},{"$f":"IFERROR(VLOOKUP(VLOOKUP(B11,'Estate Checklist'!B:J,9,0),DropDowns!G:H,2,0),\"\")","v":""},{"$f":"IFERROR(VLOOKUP(B11,'Estate Checklist'!B:E,4,0),\"\")","v":""},{"$f":"IFERROR(VLOOKUP(B11,'Estate Checklist'!B:G,6,0),\"\")","v":""},null,"",null,""]
[null,{"$f":"IFERROR(INDEX('Estate Checklist'!$B$1:$B$397, SMALL(INDEX(('Estate Checklist'!$I$1:$I$397=\"Yes\")*(MATCH(ROW('Estate Checklist'!$I$1:$I$397), ROW('Estate Checklist'!$I$1:$I$397)))+('Estate Checklist'!$I$1:$I$397<>\"Yes\")*1048577, 0, 0), ROW(A8))),\"\")","v":""},{"$f":"IFERROR(VLOOKUP(B12,'Estate Checklist'!B:C,2,0),\"\")","v":""},{"$f":"IFERROR(VLOOKUP(VLOOKUP(B12,'Estate Checklist'!B:J,9,0),DropDowns!G:H,2,0),\"\")","v":""},{"$f":"IFERROR(VLOOKUP(B12,'Estate Checklist'!B:E,4,0),\"\")","v":""},{"$f":"IFERROR(VLOOKUP(B12,'Estate Checklist'!B:G,6,0),\"\")","v":""},null,"",null,""]
[null,{"$f":"IFERROR(INDEX('Estate Checklist'!$B$1:$B$397, SMALL(INDEX(('Estate Checklist'!$I$1:$I$397=\"Yes\")*(MATCH(ROW('Estate Checklist'!$I$1:$I$397), ROW('Estate Checklist'!$I$1:$I$397)))+('Estate Checklist'!$I$1:$I$397<>\"Yes\")*1048577, 0, 0), ROW(A9))),\"\")","v":""},{"$f":"IFERROR(VLOOKUP(B13,'Estate Checklist'!B:C,2,0),\"\")","v":""},{"$f":"IFERROR(VLOOKUP(VLOOKUP(B13,'Estate Checklist'!B:J,9,0),DropDowns!G:H,2,0),\"\")","v":""},{"$f":"IFERROR(VLOOKUP(B13,'Estate Checklist'!B:E,4,0),\"\")","v":""},{"$f":"IFERROR(VLOOKUP(B13,'Estate Checklist'!B:G,6,0),\"\")","v":""},null,"",null,""]
[null,{"$f":"IFERROR(INDEX('Estate Checklist'!$B$1:$B$397, SMALL(INDEX(('Estate Checklist'!$I$1:$I$397=\"Yes\")*(MATCH(ROW('Estate Checklist'!$I$1:$I$397), ROW('Estate Checklist'!$I$1:$I$397)))+('Estate Checklist'!$I$1:$I$397<>\"Yes\")*1048577, 0, 0), ROW(A10))),\"\")","v":""},{"$f":"IFERROR(VLOOKUP(B14,'Estate Checklist'!B:C,2,0),\"\")","v":""},{"$f":"IFERROR(VLOOKUP(VLOOKUP(B14,'Estate Checklist'!B:J,9,0),DropDowns!G:H,2,0),\"\")","v":""},{"$f":"IFERROR(VLOOKUP(B14,'Estate Checklist'!B:E,4,0),\"\")","v":""},{"$f":"IFERROR(VLOOKUP(B14,'Estate Checklist'!B:G,6,0),\"\")","v":""},null,"",null,""]
[null,{"$f":"IFERROR(INDEX('Estate Checklist'!$B$1:$B$397, SMALL(INDEX(('Estate Checklist'!$I$1:$I$397=\"Yes\")*(MATCH(ROW('Estate Checklist'!$I$1:$I$397), ROW('Estate Checklist'!$I$1:$I$397)))+('Estate Checklist'!$I$1:$I$397<>\"Yes\")*1048577, 0, 0), ROW(A11))),\"\")","v":""},{"$f":"IFERROR(VLOOKUP(B15,'Estate Checklist'!B:C,2,0),\"\")","v":""},{"$f":"IFERROR(VLOOKUP(VLOOKUP(B15,'Estate Checklist'!B:J,9,0),DropDowns!G:H,2,0),\"\")","v":""},{"$f":"IFERROR(VLOOKUP(B15,'Estate Checklist'!B:E,4,0),\"\")","v":""},{"$f":"IFERROR(VLOOKUP(B15,'Estate Checklist'!B:G,6,0),\"\")","v":""},null,"",null,""]
{"$rows_left_out":186}
{"sheet":"Instructions - Outgrower","index":3,"n_rows":40,"n_cols":2,"rows_kept":40,"cut":false,"hidden":false,"merged":[[1,1,1,16],[38,1,38,16],[39,1,39,16]]}
[]
[null,"TOOL NAVIGATION & ENTRY INSTRUCTIONS"]
[]
[]
[]
[]
[]
[]
[]
[]
[]
[]
[]
[]
[]
{"$rows_left_out":26}
{"sheet":"Outgrower Checklist","index":4,"n_rows":326,"n_cols":10,"rows_kept":326,"cut":false,"hidden":false,"merged":[]}
[]
[null,1,"Evaluation Checklists",null,"Status","Comments & Documentation","Risk (1=low; 3=high)",null,"Report Ident","Group"]
[null,2]
[null,3,"I. Outgrower Policy and Capacity Assessment",{"$f":"IF(COUNT(D5:D19)=0,\"\",ROUND(SUM(D5:D19)/COUNT(D5:D19),0))","v":""},null,null,{"$f":"IFERROR(ROUND(SUM(G5:G18)/COUNT(G5:G18),0),\"\")","v":""}]
[null,null,null,{"$f":"IF(OR(E5=\"\",E5=\"(select option)\"),\"\",VLOOKUP(E5,DropDowns!C:D,2,0))","v":""}]
[null,5,"1.1 Outgrower Policy"]
[null,6,"1.1.1 Does the company’s land rights and ESIA policies apply to outgrower schemes or other alternative business models (in addition to land the company directly owns, leases, or uses)?",{"$f":"IF(OR(E7=\"\",E7=\"(select option)\"),\"\",IF(VLOOKUP(E7,DropDowns!B:D,3,0)=0,\"\",VLOOKUP(E7,DropDowns!B:D,3,0)))","v":""},"(select option)",null,"(select level)",null,{"$f":"IF(OR(AND(D7<3,E7<>\"N/A\" ),AND(G7>1,G7<>\"(select level)\",E7<>\"N/A\")),\"Yes\",\"No\")","v":"No"},1]
[null,7,"1.1.2 Are outgrower bodies (e.g., outgrower associations, trusts, cooperatives, etc.) and farmers aware of the company’s policies, including whether they apply to them?",{"$f":"IF(OR(E8=\"\",E8=\"(select option)\"),\"\",IF(VLOOKUP(E8,DropDowns!B:D,3,0)=0,\"\",VLOOKUP(E8,DropDowns!B:D,3,0)))","v":""},"(select option)",null,"(select level)",null,{"$f":"IF(OR(AND(D8<3,E8<>\"N/A\" ),AND(G8>1,G8<>\"(select level)\",E8<>\"N/A\")),\"Yes\",\"No\")","v":"No"},1]
[null,8,"1.1.3 Are the land rights and ESIA policies referenced in governance documents and agreements between outgrower bodies, outgrower farmers, and the company (e.g., bylaws, cane sourcing agreements, etc.)?",{"$f":"IF(OR(E9=\"\",E9=\"(select option)\"),\"\",IF(VLOOKUP(E9,DropDowns!B:D,3,0)=0,\"\",VLOOKUP(E9,DropDowns!B:D,3,0)))","v":""},"(select option)",null,"(select level)",null,"No",1]
[null,9,"1.1.4 Do references in agreements between outgrower bodies, outgrower farmers, and the company include what actions the company will take in response to noncompliance (e.g., warnings, termination of agreement, etc.)? ",{"$f":"IF(OR(E10=\"\",E10=\"(select option)\"),\"\",IF(VLOOKUP(E10,DropDowns!B:D,3,0)=0,\"\",VLOOKUP(E10,DropDowns!B:D,3,0)))","v":""},"(select option)",null,"(select level)",null,"No",1]
[null,10,"1.1.5 Does the company’s outgrower strategy address how to sensitize outgrower bodies and farmers on its land rights and ESIA policies?",{"$f":"IF(OR(E11=\"\",E11=\"(select option)\"),\"\",IF(VLOOKUP(E11,DropDowns!B:D,3,0)=0,\"\",VLOOKUP(E11,DropDowns!B:D,3,0)))","v":""},"(select option)",null,"(select level)",null,"No",1]
[null,11,"1.1.6 Does the outgrower strategy address how to incentivize and enforce outgrower bodies and farmers’ compliance with its land rights and ESIA policies? ",{"$f":"IF(OR(E12=\"\",E12=\"(select option)\"),\"\",IF(VLOOKUP(E12,DropDowns!B:D,3,0)=0,\"\",VLOOKUP(E12,DropDowns!B:D,3,0)))","v":""},"(select option)",null,"(select level)",null,"No",1]
[null,12,null,{"$f":"IF(OR(E13=\"\",E13=\"(select option)\"),\"\",VLOOKUP(E13,DropDowns!C:D,2,0))","v":""},null,null,null,null,"No",1]
[null,13,null,{"$f":"IF(OR(E14=\"\",E14=\"(select option)\"),\"\",VLOOKUP(E14,DropDowns!C:D,2,0))","v":""},null,null,null,null,"No",1]
[null,14,"1.2 Staff Capacity",{"$f":"IF(OR(E15=\"\",E15=\"(select option)\"),\"\",VLOOKUP(E15,DropDowns!C:D,2,0))","v":""},null,null,null,null,"No",1]
{"$rows_left_out":312}
{"sheet":"Outgrower Report","index":5,"n_rows":200,"n_cols":12,"rows_kept":200,"cut":false,"hidden":false,"merged":[[1,1,1,11],[3,7,3,10]]}
[]
[null,"Outgrower Follow-Up Report"]
[]
[null,"Checklist Row","Checklist Item","Section (Main Checklist Title)","Status","Risk (1=low; 3=high)","Follow-Up Actions","Capacity (Who Will Carry Out Workplan Activities)",null,null,null,"Timeline/Road Map"]
[null,{"$f":"IFERROR(INDEX('Outgrower Checklist'!$B$1:$B$396, SMALL(INDEX(('Outgrower Checklist'!$I$1:$I$396=\"Yes\")*(MATCH(ROW('Outgrower Checklist'!$I$1:$I$396), ROW('Outgrower Checklist'!$I$1:$I$396)))+('Outgrower Checklist'!$I$1:$I$396<>\"Yes\")*1048577, 0, 0), ROW(A1))),\"\")","v":""},{"$f":"IFERROR(VLOOKUP(B5,'Outgrower Checklist'!B:C,2,0),\"\")","v":""},{"$f":"IFERROR(VLOOKUP(VLOOKUP(B5,'Outgrower Checklist'!B:J,9,0),DropDowns!G:I,3,0),\"\")","v":""},{"$f":"IFERROR(VLOOKUP(B5,'Outgrower Checklist'!B:E,4,0),\"\")","v":""},{"$f":"IFERROR(VLOOKUP(B5,'Outgrower Checklist'!B:G,6,0),\"\")","v":""},null,{"$f":"IF(B5<>\"\",\"Internal:\",\"\")","v":""},null,{"$f":"IF(B5<>\"\",\"External:\",\"\")","v":""}]
[null,{"$f":"IFERROR(INDEX('Outgrower Checklist'!$B$1:$B$396, SMALL(INDEX(('Outgrower Checklist'!$I$1:$I$396=\"Yes\")*(MATCH(ROW('Outgrower Checklist'!$I$1:$I$396), ROW('Outgrower Checklist'!$I$1:$I$396)))+('Outgrower Checklist'!$I$1:$I$396<>\"Yes\")*1048577, 0, 0), ROW(A2))),\"\")","v":""},{"$f":"IFERROR(VLOOKUP(B6,'Outgrower Checklist'!B:C,2,0),\"\")","v":""},{"$f":"IFERROR(VLOOKUP(VLOOKUP(B6,'Outgrower Checklist'!B:J,9,0),DropDowns!G:I,3,0),\"\")","v":""},{"$f":"IFERROR(VLOOKUP(B6,'Outgrower Checklist'!B:E,4,0),\"\")","v":""},{"$f":"IFERROR(VLOOKUP(B6,'Outgrower Checklist'!B:G,6,0),\"\")","v":""},null,{"$f":"IF(B6<>\"\",\"Internal:\",\"\")","v":""},null,{"$f":"IF(B6<>\"\",\"External:\",\"\")","v":""}]
[null,{"$f":"IFERROR(INDEX('Outgrower Checklist'!$B$1:$B$396, SMALL(INDEX(('Outgrower Checklist'!$I$1:$I$396=\"Yes\")*(MATCH(ROW('Outgrower Checklist'!$I$1:$I$396), ROW('Outgrower Checklist'!$I$1:$I$396)))+('Outgrower Checklist'!$I$1:$I$396<>\"Yes\")*1048577, 0, 0), ROW(A3))),\"\")","v":""},{"$f":"IFERROR(VLOOKUP(B7,'Outgrower Checklist'!B:C,2,0),\"\")","v":""},{"$f":"IFERROR(VLOOKUP(VLOOKUP(B7,'Outgrower Checklist'!B:J,9,0),DropDowns!G:I,3,0),\"\")","v":""},{"$f":"IFERROR(VLOOKUP(B7,'Outgrower Checklist'!B:E,4,0),\"\")","v":""},{"$f":"IFERROR(VLOOKUP(B7,'Outgrower Checklist'!B:G,6,0),\"\")","v":""},null,"",null,""]
[null,{"$f":"IFERROR(INDEX('Outgrower Checklist'!$B$1:$B$396, SMALL(INDEX(('Outgrower Checklist'!$I$1:$I$396=\"Yes\")*(MATCH(ROW('Outgrower Checklist'!$I$1:$I$396), ROW('Outgrower Checklist'!$I$1:$I$396)))+('Outgrower Checklist'!$I$1:$I$396<>\"Yes\")*1048577, 0, 0), ROW(A4))),\"\")","v":""},{"$f":"IFERROR(VLOOKUP(B8,'Outgrower Checklist'!B:C,2,0),\"\")","v":""},{"$f":"IFERROR(VLOOKUP(VLOOKUP(B8,'Outgrower Checklist'!B:J,9,0),DropDowns!G:I,3,0),\"\")","v":""},{"$f":"IFERROR(VLOOKUP(B8,'Outgrower Checklist'!B:E,4,0),\"\")","v":""},{"$f":"IFERROR(VLOOKUP(B8,'Outgrower Checklist'!B:G,6,0),\"\")","v":""},null,"",null,""]
[null,{"$f":"IFERROR(INDEX('Outgrower Checklist'!$B$1:$B$396, SMALL(INDEX(('Outgrower Checklist'!$I$1:$I$396=\"Yes\")*(MATCH(ROW('Outgrower Checklist'!$I$1:$I$396), ROW('Outgrower Checklist'!$I$1:$I$396)))+('Outgrower Checklist'!$I$1:$I$396<>\"Yes\")*1048577, 0, 0), ROW(A5))),\"\")","v":""},{"$f":"IFERROR(VLOOKUP(B9,'Outgrower Checklist'!B:C,2,0),\"\")","v":""},{"$f":"IFERROR(VLOOKUP(VLOOKUP(B9,'Outgrower Checklist'!B:J,9,0),DropDowns!G:I,3,0),\"\")","v":""},{"$f":"IFERROR(VLOOKUP(B9,'Outgrower Checklist'!B:E,4,0),\"\")","v":""},{"$f":"IFERROR(VLOOKUP(B9,'Outgrower Checklist'!B:G,6,0),\"\")","v":""},null,"",null,""]
[null,{"$f":"IFERROR(INDEX('Outgrower Checklist'!$B$1:$B$396, SMALL(INDEX(('Outgrower Checklist'!$I$1:$I$396=\"Yes\")*(MATCH(ROW('Outgrower Checklist'!$I$1:$I$396), ROW('Outgrower Checklist'!$I$1:$I$396)))+('Outgrower Checklist'!$I$1:$I$396<>\"Yes\")*1048577, 0, 0), ROW(A6))),\"\")","v":""},{"$f":"IFERROR(VLOOKUP(B10,'Outgrower Checklist'!B:C,2,0),\"\")","v":""},{"$f":"IFERROR(VLOOKUP(VLOOKUP(B10,'Outgrower Checklist'!B:J,9,0),DropDowns!G:I,3,0),\"\")","v":""},{"$f":"IFERROR(VLOOKUP(B10,'Outgrower Checklist'!B:E,4,0),\"\")","v":""},{"$f":"IFERROR(VLOOKUP(B10,'Outgrower Checklist'!B:G,6,0),\"\")","v":""},null,"",null,""]
[null,{"$f":"IFERROR(INDEX('Outgrower Checklist'!$B$1:$B$396, SMALL(INDEX(('Outgrower Checklist'!$I$1:$I$396=\"Yes\")*(MATCH(ROW('Outgrower Checklist'!$I$1:$I$396), ROW('Outgrower Checklist'!$I$1:$I$396)))+('Outgrower Checklist'!$I$1:$I$396<>\"Yes\")*1048577, 0, 0), ROW(A7))),\"\")","v":""},{"$f":"IFERROR(VLOOKUP(B11,'Outgrower Checklist'!B:C,2,0),\"\")","v":""},{"$f":"IFERROR(VLOOKUP(VLOOKUP(B11,'Outgrower Checklist'!B:J,9,0),DropDowns!G:I,3,0),\"\")","v":""},{"$f":"IFERROR(VLOOKUP(B11,'Outgrower Checklist'!B:E,4,0),\"\")","v":""},{"$f":"IFERROR(VLOOKUP(B11,'Outgrower Checklist'!B:G,6,0),\"\")","v":""},null,"",null,""]
[null,{"$f":"IFERROR(INDEX('Outgrower Checklist'!$B$1:$B$396, SMALL(INDEX(('Outgrower Checklist'!$I$1:$I$396=\"Yes\")*(MATCH(ROW('Outgrower Checklist'!$I$1:$I$396), ROW('Outgrower Checklist'!$I$1:$I$396)))+('Outgrower Checklist'!$I$1:$I$396<>\"Yes\")*1048577, 0, 0), ROW(A8))),\"\")","v":""},{"$f":"IFERROR(VLOOKUP(B12,'Outgrower Checklist'!B:C,2,0),\"\")","v":""},{"$f":"IFERROR(VLOOKUP(VLOOKUP(B12,'Outgrower Checklist'!B:J,9,0),DropDowns!G:I,3,0),\"\")","v":""},{"$f":"IFERROR(VLOOKUP(B12,'Outgrower Checklist'!B:E,4,0),\"\")","v":""},{"$f":"IFERROR(VLOOKUP(B12,'Outgrower Checklist'!B:G,6,0),\"\")","v":""},null,"",null,""]
[null,{"$f":"IFERROR(INDEX('Outgrower Checklist'!$B$1:$B$396, SMALL(INDEX(('Outgrower Checklist'!$I$1:$I$396=\"Yes\")*(MATCH(ROW('Outgrower Checklist'!$I$1:$I$396), ROW('Outgrower Checklist'!$I$1:$I$396)))+('Outgrower Checklist'!$I$1:$I$396<>\"Yes\")*1048577, 0, 0), ROW(A9))),\"\")","v":""},{"$f":"IFERROR(VLOOKUP(B13,'Outgrower Checklist'!B:C,2,0),\"\")","v":""},{"$f":"IFERROR(VLOOKUP(VLOOKUP(B13,'Outgrower Checklist'!B:J,9,0),DropDowns!G:I,3,0),\"\")","v":""},{"$f":"IFERROR(VLOOKUP(B13,'Outgrower Checklist'!B:E,4,0),\"\")","v":""},{"$f":"IFERROR(VLOOKUP(B13,'Outgrower Checklist'!B:G,6,0),\"\")","v":""},null,"",null,""]
[null,{"$f":"IFERROR(INDEX('Outgrower Checklist'!$B$1:$B$396, SMALL(INDEX(('Outgrower Checklist'!$I$1:$I$396=\"Yes\")*(MATCH(ROW('Outgrower Checklist'!$I$1:$I$396), ROW('Outgrower Checklist'!$I$1:$I$396)))+('Outgrower Checklist'!$I$1:$I$396<>\"Yes\")*1048577, 0, 0), ROW(A10))),\"\")","v":""},{"$f":"IFERROR(VLOOKUP(B14,'Outgrower Checklist'!B:C,2,0),\"\")","v":""},{"$f":"IFERROR(VLOOKUP(VLOOKUP(B14,'Outgrower Checklist'!B:J,9,0),DropDowns!G:I,3,0),\"\")","v":""},{"$f":"IFERROR(VLOOKUP(B14,'Outgrower Checklist'!B:E,4,0),\"\")","v":""},{"$f":"IFERROR(VLOOKUP(B14,'Outgrower Checklist'!B:G,6,0),\"\")","v":""},null,"",null,""]
[null,{"$f":"IFERROR(INDEX('Outgrower Checklist'!$B$1:$B$396, SMALL(INDEX(('Outgrower Checklist'!$I$1:$I$396=\"Yes\")*(MATCH(ROW('Outgrower Checklist'!$I$1:$I$396), ROW('Outgrower Checklist'!$I$1:$I$396)))+('Outgrower Checklist'!$I$1:$I$396<>\"Yes\")*1048577, 0, 0), ROW(A11))),\"\")","v":""},{"$f":"IFERROR(VLOOKUP(B15,'Outgrower Checklist'!B:C,2,0),\"\")","v":""},{"$f":"IFERROR(VLOOKUP(VLOOKUP(B15,'Outgrower Checklist'!B:J,9,0),DropDowns!G:I,3,0),\"\")","v":""},{"$f":"IFERROR(VLOOKUP(B15,'Outgrower Checklist'!B:E,4,0),\"\")","v":""},{"$f":"IFERROR(VLOOKUP(B15,'Outgrower Checklist'!B:G,6,0),\"\")","v":""},null,"",null,""]
{"$rows_left_out":186}
{"sheet":"DropDowns","index":6,"n_rows":26,"n_cols":9,"rows_kept":26,"cut":false,"hidden":true,"merged":[]}
[]
[null,"Status %","Degree",null,"Risk",null,"Group Number","Estate Group Name","Outgrower Group Name"]
[null,"(select option)","(select option)",null,"(select level)",null,1,"Corporate Policy and Capacity Assessment","Outgrower Policy and Capacity Assessment"]
[null,"< 25%","Little",1,1,null,2,"Legal, Administrative, and Institutional Review","Legal, Administrative, and Institutional Review"]
[null,"26 - 50%","Marginal",2,2,null,3,"Impact Assessments","Impact Assessments"]
[null,"51 - 75%","Substantial",3,3,null,4,"Consultation and Engagement","Consultation and Engagement"]
[null,"> 75%","Considerable",4,null,null,5,"Contracting and Agreements","Contracting and Agreements"]
[null,"N/A","Not Applicable",null,null,null,6,"Grievances & Feedback","Grievances & Feedback"]
[null,null,null,null,null,null,7,"Encroachment"]
[null,null,null,null,null,null,8,"Change of Land Use"]
[]
[]
[]
[]
[]
{"$rows_left_out":11}